Information card for entry 7063468
Formula |
C33 H54 N4 O Si4 Th |
Calculated formula |
C33 H54 N4 O Si4 Th |
Title of publication |
Advancing understanding of comparison of M-O covalency in isostructural M-OSiMe3 (M = Ce, Th, U) complexes |
Authors of publication |
Liu, Kang; Chi, Xiao-Wang; Guo, Yan; Hu, Kongqiu; Mei, Lei; Yu, Jipan; Shi, Weiqun |
Journal of publication |
New Journal of Chemistry |
Year of publication |
2024 |
a |
17.113 ± 0.004 Å |
b |
17.113 ± 0.004 Å |
c |
24.012 ± 0.005 Å |
α |
90° |
β |
90° |
γ |
120° |
Cell volume |
6090 ± 2 Å3 |
Cell temperature |
170 K |
Ambient diffraction temperature |
170 K |
Number of distinct elements |
6 |
Space group number |
161 |
Hermann-Mauguin space group symbol |
R 3 c :H |
Hall space group symbol |
R 3 -2"c |
Residual factor for all reflections |
0.0149 |
Residual factor for significantly intense reflections |
0.0109 |
Weighted residual factors for significantly intense reflections |
0.024 |
Weighted residual factors for all reflections included in the refinement |
0.0256 |
Goodness-of-fit parameter for all reflections included in the refinement |
1.102 |
Diffraction radiation wavelength |
0.71076 Å |
Diffraction radiation type |
MoKα |
Yes |
No |
No |