Information card for entry 7102248
Common name | Manganese carboxylate |
Formula | C14 H10 Mn2 N0 O7 |
Calculated formula | C14 H10 Mn2 O7 |
Title of publication | The role of temperature on the structure and dimensionality of MOFs: an illustrative study of the formation of manganese oxy-bis(benzoate) structures. |
Authors of publication | Mahata, Partha; Sundaresan, A; Natarajan, Srinivasan |
Journal of publication | Chemical communications (Cambridge, England) |
Year of publication | 2007 |
Journal issue | 43 |
Pages of publication | 4471 - 4473 |
a | 29.135 ± 0.008 Å |
b | 7.461 ± 0.002 Å |
c | 6.1111 ± 0.0017 Å |
α | 90° |
β | 90° |
γ | 90° |
Cell volume | 1328.4 ± 0.6 Å3 |
Cell temperature | 293 ± 2 K |
Ambient diffraction temperature | 293 ± 2 K |
Number of distinct elements | 5 |
Space group number | 60 |
Hermann-Mauguin space group symbol | P n c a |
Hall space group symbol | -P 2a 2n |
Residual factor for all reflections | 0.0893 |
Residual factor for significantly intense reflections | 0.0665 |
Weighted residual factors for significantly intense reflections | 0.1183 |
Weighted residual factors for all reflections included in the refinement | 0.1243 |
Goodness-of-fit parameter for all reflections included in the refinement | 1.292 |
Diffraction radiation wavelength | 0.71073 Å |
Diffraction radiation type | MoKα |