Information card for entry 7102249
Common name | Manganese carboxylate |
Formula | C14 H14 Mn N0 O9 |
Calculated formula | C14 H14 Mn O9 |
Title of publication | The role of temperature on the structure and dimensionality of MOFs: an illustrative study of the formation of manganese oxy-bis(benzoate) structures. |
Authors of publication | Mahata, Partha; Sundaresan, A; Natarajan, Srinivasan |
Journal of publication | Chemical communications (Cambridge, England) |
Year of publication | 2007 |
Journal issue | 43 |
Pages of publication | 4471 - 4473 |
a | 16.902 ± 0.006 Å |
b | 10.506 ± 0.004 Å |
c | 9.062 ± 0.003 Å |
α | 90° |
β | 94.524 ± 0.005° |
γ | 90° |
Cell volume | 1604.2 ± 0.9 Å3 |
Cell temperature | 273 ± 2 K |
Ambient diffraction temperature | 273 ± 2 K |
Number of distinct elements | 5 |
Space group number | 14 |
Hermann-Mauguin space group symbol | P 1 21/c 1 |
Hall space group symbol | -P 2ybc |
Residual factor for all reflections | 0.0511 |
Residual factor for significantly intense reflections | 0.0444 |
Weighted residual factors for significantly intense reflections | 0.1133 |
Weighted residual factors for all reflections included in the refinement | 0.118 |
Goodness-of-fit parameter for all reflections included in the refinement | 1.031 |
Diffraction radiation wavelength | 0.71073 Å |
Diffraction radiation type | MoKα |