Information card for entry 7125337
Formula | C19 H18 N2 O3 |
Calculated formula | C19 H18 N2 O3 |
Title of publication | Diversity-oriented synthesis of imidazo[2,1-a]isoquinolines. |
Authors of publication | Mai, Shaoyu; Luo, Yixin; Huang, Xianyun; Shu, Zhenghao; Li, Bingnan; Lan, Yu; Song, Qiuling |
Journal of publication | Chemical communications (Cambridge, England) |
Year of publication | 2018 |
Journal volume | 54 |
Journal issue | 73 |
Pages of publication | 10240 - 10243 |
a | 9.0284 ± 0.0009 Å |
b | 12.6694 ± 0.0008 Å |
c | 14.298 ± 0.0011 Å |
α | 90° |
β | 96.266 ± 0.008° |
γ | 90° |
Cell volume | 1625.7 ± 0.2 Å3 |
Cell temperature | 298 K |
Ambient diffraction temperature | 298 K |
Number of distinct elements | 4 |
Space group number | 14 |
Hermann-Mauguin space group symbol | P 1 21/n 1 |
Hall space group symbol | -P 2yn |
Residual factor for all reflections | 0.0892 |
Residual factor for significantly intense reflections | 0.0527 |
Weighted residual factors for significantly intense reflections | 0.1124 |
Weighted residual factors for all reflections included in the refinement | 0.1359 |
Goodness-of-fit parameter for all reflections included in the refinement | 1.0654 |
Diffraction radiation probe | x-ray |
Diffraction radiation wavelength | 0.71073 Å |
Diffraction radiation type | MoKα |