Information card for entry 7125338
Formula | C20 H14 N2 |
Calculated formula | C20 H14 N2 |
Title of publication | Diversity-oriented synthesis of imidazo[2,1-a]isoquinolines. |
Authors of publication | Mai, Shaoyu; Luo, Yixin; Huang, Xianyun; Shu, Zhenghao; Li, Bingnan; Lan, Yu; Song, Qiuling |
Journal of publication | Chemical communications (Cambridge, England) |
Year of publication | 2018 |
Journal volume | 54 |
Journal issue | 73 |
Pages of publication | 10240 - 10243 |
a | 7.0181 ± 0.0004 Å |
b | 7.9004 ± 0.0005 Å |
c | 25.5706 ± 0.0016 Å |
α | 90° |
β | 92.661 ± 0.006° |
γ | 90° |
Cell volume | 1416.25 ± 0.15 Å3 |
Cell temperature | 298 K |
Ambient diffraction temperature | 298 K |
Number of distinct elements | 3 |
Space group number | 14 |
Hermann-Mauguin space group symbol | P 1 21/c 1 |
Hall space group symbol | -P 2ybc |
Residual factor for all reflections | 0.1357 |
Residual factor for significantly intense reflections | 0.0701 |
Weighted residual factors for significantly intense reflections | 0.1561 |
Weighted residual factors for all reflections included in the refinement | 0.2151 |
Goodness-of-fit parameter for all reflections included in the refinement | 0.9616 |
Diffraction radiation probe | x-ray |
Diffraction radiation wavelength | 0.71073 Å |
Diffraction radiation type | MoKα |