Information card for entry 7125340
Formula | C121 H200 N6 O4 Si4 Y2 |
Calculated formula | C121 H192 N6 O4 Si4 Y2 |
Title of publication | Stereo-selectivity switchable ROP of rac-β-butyrolactone initiated by salan-ligated rare-earth metal amide complexes: the key role of the substituents on ligand frameworks. |
Authors of publication | Zhuo, Zhixing; Zhang, Chen; Luo, Yunjie; Wang, Yaorong; Yao, Yingming; Yuan, Dan; Cui, Dongmei |
Journal of publication | Chemical communications (Cambridge, England) |
Year of publication | 2018 |
Journal volume | 54 |
Journal issue | 85 |
Pages of publication | 11998 - 12001 |
a | 23.3487 ± 0.0009 Å |
b | 12.1983 ± 0.0005 Å |
c | 21.8684 ± 0.0009 Å |
α | 90° |
β | 92.992 ± 0.004° |
γ | 90° |
Cell volume | 6219.9 ± 0.4 Å3 |
Cell temperature | 223 ± 2 K |
Ambient diffraction temperature | 223 ± 2 K |
Number of distinct elements | 6 |
Space group number | 13 |
Hermann-Mauguin space group symbol | P 1 2/c 1 |
Hall space group symbol | -P 2yc |
Residual factor for all reflections | 0.1221 |
Residual factor for significantly intense reflections | 0.0719 |
Weighted residual factors for significantly intense reflections | 0.1757 |
Weighted residual factors for all reflections included in the refinement | 0.2003 |
Goodness-of-fit parameter for all reflections included in the refinement | 1.016 |
Diffraction radiation wavelength | 0.71073 Å |
Diffraction radiation type | MoKα |