Information card for entry 7125339
Formula |
C16 H14 N2 O |
Calculated formula |
C16 H14 N2 O |
Title of publication |
Diversity-oriented synthesis of imidazo[2,1-a]isoquinolines. |
Authors of publication |
Mai, Shaoyu; Luo, Yixin; Huang, Xianyun; Shu, Zhenghao; Li, Bingnan; Lan, Yu; Song, Qiuling |
Journal of publication |
Chemical communications (Cambridge, England) |
Year of publication |
2018 |
Journal volume |
54 |
Journal issue |
73 |
Pages of publication |
10240 - 10243 |
a |
5.729 ± 0.0015 Å |
b |
14.295 ± 0.005 Å |
c |
15.456 ± 0.004 Å |
α |
90° |
β |
90° |
γ |
90° |
Cell volume |
1265.8 ± 0.6 Å3 |
Cell temperature |
294.29 ± 0.18 K |
Ambient diffraction temperature |
294.29 ± 0.18 K |
Number of distinct elements |
4 |
Space group number |
19 |
Hermann-Mauguin space group symbol |
P 21 21 21 |
Hall space group symbol |
P 2ac 2ab |
Residual factor for all reflections |
0.1325 |
Residual factor for significantly intense reflections |
0.0744 |
Weighted residual factors for significantly intense reflections |
0.0878 |
Weighted residual factors for all reflections included in the refinement |
0.1071 |
Goodness-of-fit parameter for all reflections included in the refinement |
1.0593 |
Diffraction radiation wavelength |
0.71073 Å |
Diffraction radiation type |
MoKα |
Yes |
No |
No |