Information card for entry 7133205
Common name | 9-phosphatriptycene selenide |
Chemical name | 9-phosphatriptycene selenide |
Formula | C19 H13 P Se |
Calculated formula | C19 H13 P Se |
Title of publication | Regulating iminophosphorane PN bond reactivity through geometric constraints with cage-shaped triarylphosphines. |
Authors of publication | Hu, Lei; Chakraborty, Sayandip; Tumanov, Nikolay; Wouters, Johan; Robiette, Raphaël; Berionni, Guillaume |
Journal of publication | Chemical communications (Cambridge, England) |
Year of publication | 2024 |
Journal volume | 60 |
Journal issue | 55 |
Pages of publication | 7073 - 7076 |
a | 14.1963 ± 0.0006 Å |
b | 13.7375 ± 0.0006 Å |
c | 15.8281 ± 0.0007 Å |
α | 90° |
β | 90.897 ± 0.001° |
γ | 90° |
Cell volume | 3086.4 ± 0.2 Å3 |
Cell temperature | 297 ± 2 K |
Ambient diffraction temperature | 297 ± 2 K |
Number of distinct elements | 4 |
Space group number | 15 |
Hermann-Mauguin space group symbol | C 1 2/c 1 |
Hall space group symbol | -C 2yc |
Residual factor for all reflections | 0.0428 |
Residual factor for significantly intense reflections | 0.0385 |
Weighted residual factors for significantly intense reflections | 0.0964 |
Weighted residual factors for all reflections included in the refinement | 0.1038 |
Goodness-of-fit parameter for all reflections included in the refinement | 1.088 |
Diffraction radiation wavelength | 0.56086 Å |
Diffraction radiation type | AgKα |