Information card for entry 7133286
Formula | C11 H18 O Os |
Calculated formula | C11 H18 O Os |
Title of publication | CO<sub>2</sub> cleavage by tantalum/M (M = iridium, osmium) heterobimetallic complexes. |
Authors of publication | Lachguar, Abdelhak; Ye, Christopher Z.; Kelly, Sheridon N.; Jeanneau, Erwann; Del Rosal, Iker; Maron, Laurent; Veyre, Laurent; Thieuleux, Chloé; Arnold, John; Camp, Clément |
Journal of publication | Chemical communications (Cambridge, England) |
Year of publication | 2024 |
Journal volume | 60 |
Journal issue | 61 |
Pages of publication | 7878 - 7881 |
a | 8.149 ± 0.0002 Å |
b | 11.0276 ± 0.0002 Å |
c | 13.2481 ± 0.0002 Å |
α | 90° |
β | 101.769 ± 0.002° |
γ | 90° |
Cell volume | 1165.5 ± 0.04 Å3 |
Cell temperature | 100 ± 0.3 K |
Ambient diffraction temperature | 100 ± 0.3 K |
Number of distinct elements | 4 |
Space group number | 14 |
Hermann-Mauguin space group symbol | P 1 21/n 1 |
Hall space group symbol | -P 2yn |
Residual factor for all reflections | 0.0231 |
Residual factor for significantly intense reflections | 0.0212 |
Weighted residual factors for significantly intense reflections | 0.0497 |
Weighted residual factors for all reflections included in the refinement | 0.0503 |
Goodness-of-fit parameter for all reflections included in the refinement | 1.126 |
Diffraction radiation probe | x-ray |
Diffraction radiation wavelength | 0.71073 Å |
Diffraction radiation type | MoKα |