Information card for entry 7133285
Formula | C25 H51 Os Ta |
Calculated formula | C25 H51 Os Ta |
Title of publication | CO<sub>2</sub> cleavage by tantalum/M (M = iridium, osmium) heterobimetallic complexes. |
Authors of publication | Lachguar, Abdelhak; Ye, Christopher Z.; Kelly, Sheridon N.; Jeanneau, Erwann; Del Rosal, Iker; Maron, Laurent; Veyre, Laurent; Thieuleux, Chloé; Arnold, John; Camp, Clément |
Journal of publication | Chemical communications (Cambridge, England) |
Year of publication | 2024 |
Journal volume | 60 |
Journal issue | 61 |
Pages of publication | 7878 - 7881 |
a | 17.7258 ± 0.0004 Å |
b | 16.513 ± 0.0002 Å |
c | 19.8168 ± 0.0004 Å |
α | 90° |
β | 104.405 ± 0.002° |
γ | 90° |
Cell volume | 5618.14 ± 0.19 Å3 |
Cell temperature | 293 ± 2 K |
Ambient diffraction temperature | 293 ± 2 K |
Number of distinct elements | 4 |
Space group number | 15 |
Hermann-Mauguin space group symbol | C 1 2/c 1 |
Hall space group symbol | -C 2yc |
Residual factor for all reflections | 0.0188 |
Residual factor for significantly intense reflections | 0.0165 |
Weighted residual factors for significantly intense reflections | 0.0337 |
Weighted residual factors for all reflections included in the refinement | 0.0342 |
Goodness-of-fit parameter for all reflections included in the refinement | 1.094 |
Diffraction radiation probe | x-ray |
Diffraction radiation wavelength | 0.71073 Å |
Diffraction radiation type | MoKα |