Information card for entry 7133358
Formula | C16 H11 F5 O2 S2 |
Calculated formula | C16 H11 F5 O2 S2 |
Title of publication | Tunable electrochemical diverse sulfurization of sulfoxonium ylides with disulfides. |
Authors of publication | Hu, Xinwei; Zhong, Kaihui; Ruan, Zhixiong |
Journal of publication | Chemical communications (Cambridge, England) |
Year of publication | 2024 |
Journal volume | 60 |
Journal issue | 65 |
Pages of publication | 8573 - 8576 |
a | 9.0497 ± 0.0005 Å |
b | 9.8617 ± 0.0006 Å |
c | 17.5484 ± 0.0011 Å |
α | 92.637 ± 0.005° |
β | 91.848 ± 0.005° |
γ | 95.942 ± 0.005° |
Cell volume | 1554.97 ± 0.16 Å3 |
Cell temperature | 169.99 ± 0.1 K |
Ambient diffraction temperature | 169.99 ± 0.1 K |
Number of distinct elements | 5 |
Space group number | 2 |
Hermann-Mauguin space group symbol | P -1 |
Hall space group symbol | -P 1 |
Residual factor for all reflections | 0.0839 |
Residual factor for significantly intense reflections | 0.0684 |
Weighted residual factors for significantly intense reflections | 0.1653 |
Weighted residual factors for all reflections included in the refinement | 0.1752 |
Goodness-of-fit parameter for all reflections included in the refinement | 1.061 |
Diffraction radiation probe | x-ray |
Diffraction radiation wavelength | 0.71073 Å |
Diffraction radiation type | MoKα |