Information card for entry 7133359
Formula | C14 H8 N2 O8 |
Calculated formula | C14 H8 N2 O8 |
Title of publication | Amino acid-appended pyromellitic diimide liquid materials, their photoluminescence, and the thermal response that turns the photoluminescence off. |
Authors of publication | Omura, Takumi; Morisako, Shogo; Isoda, Kyosuke |
Journal of publication | Chemical communications (Cambridge, England) |
Year of publication | 2024 |
Journal volume | 60 |
Journal issue | 70 |
Pages of publication | 9352 - 9355 |
a | 4.9931 ± 0.0002 Å |
b | 5.055 ± 0.0003 Å |
c | 12.7089 ± 0.0006 Å |
α | 87.739 ± 0.004° |
β | 85.844 ± 0.003° |
γ | 80.408 ± 0.004° |
Cell volume | 315.34 ± 0.03 Å3 |
Cell temperature | 100 ± 2 K |
Ambient diffraction temperature | 100 ± 2 K |
Number of distinct elements | 4 |
Space group number | 2 |
Hermann-Mauguin space group symbol | P -1 |
Hall space group symbol | -P 1 |
Residual factor for all reflections | 0.0497 |
Residual factor for significantly intense reflections | 0.0457 |
Weighted residual factors for significantly intense reflections | 0.1343 |
Weighted residual factors for all reflections included in the refinement | 0.1383 |
Goodness-of-fit parameter for all reflections included in the refinement | 1.078 |
Diffraction radiation probe | x-ray |
Diffraction radiation wavelength | 1.54184 Å |
Diffraction radiation type | CuKα |