Information card for entry 7133360
Formula | C30 H28 N2 O8 |
Calculated formula | C30 H28 N2 O8 |
Title of publication | Amino acid-appended pyromellitic diimide liquid materials, their photoluminescence, and the thermal response that turns the photoluminescence off. |
Authors of publication | Omura, Takumi; Morisako, Shogo; Isoda, Kyosuke |
Journal of publication | Chemical communications (Cambridge, England) |
Year of publication | 2024 |
Journal volume | 60 |
Journal issue | 70 |
Pages of publication | 9352 - 9355 |
a | 7.5542 ± 0.0001 Å |
b | 7.0242 ± 0.0001 Å |
c | 24.7028 ± 0.0003 Å |
α | 90° |
β | 96.948 ± 0.001° |
γ | 90° |
Cell volume | 1301.16 ± 0.03 Å3 |
Cell temperature | 100 ± 2 K |
Ambient diffraction temperature | 100 ± 2 K |
Number of distinct elements | 4 |
Space group number | 4 |
Hermann-Mauguin space group symbol | P 1 21 1 |
Hall space group symbol | P 2yb |
Residual factor for all reflections | 0.0259 |
Residual factor for significantly intense reflections | 0.0257 |
Weighted residual factors for significantly intense reflections | 0.0698 |
Weighted residual factors for all reflections included in the refinement | 0.0701 |
Goodness-of-fit parameter for all reflections included in the refinement | 1.033 |
Diffraction radiation probe | x-ray |
Diffraction radiation wavelength | 1.54184 Å |
Diffraction radiation type | CuKα |