Information card for entry 7201907
Formula | C10 H8 I2 N2 O2 Pb |
Calculated formula | C10 H8 I2 N2 O2 Pb |
SMILES | c1n2=[O][Pb](I)(I)[O]=n3ccccc3c2ccc1 |
Title of publication | A series of lead(II)/iodine hybrid polymers based on 1-D and 2-D metal‒organic motifs linked by different organic conjugated ligands |
Authors of publication | Wang, Yun Jie; Li, Hao Hong; Chen, Zhi Rong; Huang, Chang Cang; Huang, Xi He; Feng, Miao; Lin, Yun |
Journal of publication | CrystEngComm |
Year of publication | 2008 |
Journal volume | 10 |
Journal issue | 6 |
Pages of publication | 770 |
a | 18.866 ± 0.004 Å |
b | 8.6033 ± 0.0017 Å |
c | 9.6102 ± 0.0019 Å |
α | 90° |
β | 115.43 ± 0.03° |
γ | 90° |
Cell volume | 1408.7 ± 0.6 Å3 |
Cell temperature | 293 ± 2 K |
Ambient diffraction temperature | 293 ± 2 K |
Number of distinct elements | 6 |
Space group number | 15 |
Hermann-Mauguin space group symbol | C 1 2/c 1 |
Hall space group symbol | -C 2yc |
Residual factor for all reflections | 0.0345 |
Residual factor for significantly intense reflections | 0.0308 |
Weighted residual factors for significantly intense reflections | 0.0641 |
Weighted residual factors for all reflections included in the refinement | 0.0655 |
Goodness-of-fit parameter for all reflections included in the refinement | 1.071 |
Diffraction radiation wavelength | 0.71073 Å |
Diffraction radiation type | MoKα |