Information card for entry 7201908
Formula | C12 H13 I N2 O2 Pb |
Calculated formula | C12 H13 I N2 O2 Pb |
Title of publication | A series of lead(II)/iodine hybrid polymers based on 1-D and 2-D metal‒organic motifs linked by different organic conjugated ligands |
Authors of publication | Wang, Yun Jie; Li, Hao Hong; Chen, Zhi Rong; Huang, Chang Cang; Huang, Xi He; Feng, Miao; Lin, Yun |
Journal of publication | CrystEngComm |
Year of publication | 2008 |
Journal volume | 10 |
Journal issue | 6 |
Pages of publication | 770 |
a | 16.872 ± 0.005 Å |
b | 7.2993 ± 0.0017 Å |
c | 12.074 ± 0.003 Å |
α | 90° |
β | 107.85 ± 0.004° |
γ | 90° |
Cell volume | 1415.4 ± 0.6 Å3 |
Cell temperature | 293 ± 2 K |
Ambient diffraction temperature | 153.15 K |
Number of distinct elements | 6 |
Space group number | 14 |
Hermann-Mauguin space group symbol | P 1 21/c 1 |
Hall space group symbol | -P 2ybc |
Residual factor for all reflections | 0.0377 |
Residual factor for significantly intense reflections | 0.0331 |
Weighted residual factors for significantly intense reflections | 0.0735 |
Weighted residual factors for all reflections included in the refinement | 0.076 |
Goodness-of-fit parameter for all reflections included in the refinement | 1.025 |
Diffraction radiation wavelength | 0.71073 Å |
Diffraction radiation type | MoKα |