Information card for entry 7202625
Common name | terephthalato-bisaquo-1,2-bis(4-pirydyl)ethane-cobalt(ii) hydrated |
Chemical name | terephthalato-bisaquo-1,2-bis(4-pirydyl)ethane-cobalt(II) hydrated |
Formula | C20 H25 Co N2 O8.5 |
Calculated formula | C20 H20 Co N2 O8.5 |
Title of publication | Stabilization of the 2D inclined interpenetrated net of {[Co(bpe)(tp)(H2O)2]n by replacement of lattice water molecules with appropriate solvent |
Authors of publication | Manna, Subal Chandra; Okamoto, Ken-ichi; Zangrando, Ennio; Chaudhuri, Nirmalendu Ray |
Journal of publication | CrystEngComm |
Year of publication | 2007 |
Journal volume | 9 |
Journal issue | 3 |
Pages of publication | 199 |
a | 18.459 ± 0.013 Å |
b | 10.458 ± 0.007 Å |
c | 13.063 ± 0.01 Å |
α | 90° |
β | 102.552 ± 0.011° |
γ | 90° |
Cell volume | 2461 ± 3 Å3 |
Cell temperature | 293 ± 2 K |
Ambient diffraction temperature | 293 ± 2 K |
Number of distinct elements | 5 |
Space group number | 14 |
Hermann-Mauguin space group symbol | P 1 21/c 1 |
Hall space group symbol | -P 2ybc |
Residual factor for all reflections | 0.0558 |
Residual factor for significantly intense reflections | 0.0468 |
Weighted residual factors for significantly intense reflections | 0.1414 |
Weighted residual factors for all reflections included in the refinement | 0.1632 |
Goodness-of-fit parameter for all reflections included in the refinement | 1.016 |
Diffraction radiation wavelength | 0.71073 Å |
Diffraction radiation type | MoKα |