Information card for entry 7202626
Common name | terephthalato-bisaquo-1,2-bis(4-pyridyl)ethane-cobalt(ii) glycolethylene solvated |
Chemical name | terephthalato-bisaquo-1,2-bis(4-pyridyl)ethane-cobalt(II) glycolethylene solvated |
Formula | C22 H26 Co N2 O8 |
Calculated formula | C22 H26 Co N2 O8 |
Title of publication | Stabilization of the 2D inclined interpenetrated net of {[Co(bpe)(tp)(H2O)2]n by replacement of lattice water molecules with appropriate solvent |
Authors of publication | Manna, Subal Chandra; Okamoto, Ken-ichi; Zangrando, Ennio; Chaudhuri, Nirmalendu Ray |
Journal of publication | CrystEngComm |
Year of publication | 2007 |
Journal volume | 9 |
Journal issue | 3 |
Pages of publication | 199 |
a | 19.887 ± 0.004 Å |
b | 10.574 ± 0.004 Å |
c | 11.876 ± 0.003 Å |
α | 90° |
β | 110.79 ± 0.02° |
γ | 90° |
Cell volume | 2334.7 ± 1.2 Å3 |
Cell temperature | 293 ± 2 K |
Ambient diffraction temperature | 293 ± 2 K |
Number of distinct elements | 5 |
Space group number | 15 |
Hermann-Mauguin space group symbol | C 1 2/c 1 |
Hall space group symbol | -C 2yc |
Residual factor for all reflections | 0.0659 |
Residual factor for significantly intense reflections | 0.0417 |
Weighted residual factors for significantly intense reflections | 0.1133 |
Weighted residual factors for all reflections included in the refinement | 0.1228 |
Goodness-of-fit parameter for all reflections included in the refinement | 0.983 |
Diffraction radiation wavelength | 0.71073 Å |
Diffraction radiation type | Mokα |