Information card for entry 7203617
Formula | C38 H23 Br2 Cl5 Hg N2 O4 |
Calculated formula | C38 H23 Br2 Cl5 Hg N2 O4 |
Title of publication | Molecular tectonics: generation and packing of 1-D coordination networks formed between dibromofluorene based tectons bearing two pyridines and metal halides |
Authors of publication | Jouaiti, Abdelaziz; Kyritsakas, Nathalie; Planeix, Jean-Marc; Hosseini, Mir Wais |
Journal of publication | CrystEngComm |
Year of publication | 2006 |
Journal volume | 8 |
Journal issue | 12 |
Pages of publication | 883 |
a | 12.608 ± 0.0009 Å |
b | 16.2385 ± 0.0013 Å |
c | 37.085 ± 0.003 Å |
α | 90° |
β | 90° |
γ | 90° |
Cell volume | 7592.6 ± 1 Å3 |
Cell temperature | 173 ± 2 K |
Ambient diffraction temperature | 173 ± 2 K |
Number of distinct elements | 7 |
Space group number | 61 |
Hermann-Mauguin space group symbol | P b c a |
Hall space group symbol | -P 2ac 2ab |
Residual factor for all reflections | 0.1023 |
Residual factor for significantly intense reflections | 0.0469 |
Weighted residual factors for significantly intense reflections | 0.0844 |
Weighted residual factors for all reflections included in the refinement | 0.0993 |
Goodness-of-fit parameter for all reflections included in the refinement | 1.024 |
Diffraction radiation wavelength | 0.71073 Å |
Diffraction radiation type | MoKα |