Information card for entry 7203618
Formula | C38 H23 Br2 Cl3 Hg I2 N2 O4 |
Calculated formula | C38 H23 Br2 Cl3 Hg I2 N2 O4 |
Title of publication | Molecular tectonics: generation and packing of 1-D coordination networks formed between dibromofluorene based tectons bearing two pyridines and metal halides |
Authors of publication | Jouaiti, Abdelaziz; Kyritsakas, Nathalie; Planeix, Jean-Marc; Hosseini, Mir Wais |
Journal of publication | CrystEngComm |
Year of publication | 2006 |
Journal volume | 8 |
Journal issue | 12 |
Pages of publication | 883 |
a | 12.741 ± 0.003 Å |
b | 15.79 ± 0.003 Å |
c | 40.525 ± 0.008 Å |
α | 90° |
β | 90° |
γ | 90° |
Cell volume | 8153 ± 3 Å3 |
Cell temperature | 173 ± 2 K |
Ambient diffraction temperature | 173 ± 2 K |
Number of distinct elements | 8 |
Space group number | 61 |
Hermann-Mauguin space group symbol | P b c a |
Hall space group symbol | -P 2ac 2ab |
Residual factor for all reflections | 0.0712 |
Residual factor for significantly intense reflections | 0.0375 |
Weighted residual factors for significantly intense reflections | 0.0794 |
Weighted residual factors for all reflections included in the refinement | 0.0854 |
Goodness-of-fit parameter for all reflections included in the refinement | 1.07 |
Diffraction radiation wavelength | 0.71073 Å |
Diffraction radiation type | MoKα |