Information card for entry 7203619
Formula | C40 H25 Br4 Cl9 N2 O4 Zn |
Calculated formula | C40 H25 Br4 Cl9 N2 O4 Zn |
Title of publication | Molecular tectonics: generation and packing of 1-D coordination networks formed between dibromofluorene based tectons bearing two pyridines and metal halides |
Authors of publication | Jouaiti, Abdelaziz; Kyritsakas, Nathalie; Planeix, Jean-Marc; Hosseini, Mir Wais |
Journal of publication | CrystEngComm |
Year of publication | 2006 |
Journal volume | 8 |
Journal issue | 12 |
Pages of publication | 883 |
a | 9.1378 ± 0.0014 Å |
b | 15.927 ± 0.003 Å |
c | 17.21 ± 0.003 Å |
α | 114.132 ± 0.006° |
β | 91.838 ± 0.007° |
γ | 91.495 ± 0.007° |
Cell volume | 2282.5 ± 0.7 Å3 |
Cell temperature | 173 ± 2 K |
Ambient diffraction temperature | 173 ± 2 K |
Number of distinct elements | 7 |
Space group number | 2 |
Hermann-Mauguin space group symbol | P -1 |
Hall space group symbol | -P 1 |
Residual factor for all reflections | 0.1958 |
Residual factor for significantly intense reflections | 0.0833 |
Weighted residual factors for significantly intense reflections | 0.1911 |
Weighted residual factors for all reflections included in the refinement | 0.2293 |
Goodness-of-fit parameter for all reflections included in the refinement | 1.023 |
Diffraction radiation wavelength | 0.71073 Å |
Diffraction radiation type | MoKα |