Information card for entry 7203709
Formula | C12 H10 Cl2 Cu N2 O5 |
Calculated formula | C12 H10 Cl2 Cu N2 O5 |
Title of publication | The role of acid in the formation of hydrogen-bonded networks featuring 4,4?-dicarboxy-2,2?-bipyridine (H2dcbp): Synthesis, structural and magnetic characterisation of {[Cu(H2dcbp)Cl2]�H2O}2 and [Cu(H2dcbp)(NO3)2(H2O)] |
Authors of publication | Tynan, Eithne; Jensen, Paul; Lees, Anthea C.; Moubaraki, Boujemaa; Murray, Keith S.; Kruger, Paul E. |
Journal of publication | CrystEngComm |
Year of publication | 2005 |
Journal volume | 7 |
Journal issue | 13 |
Pages of publication | 90 |
a | 7.2504 ± 0.0016 Å |
b | 9.346 ± 0.002 Å |
c | 11.785 ± 0.003 Å |
α | 108.4 ± 0.003° |
β | 98.483 ± 0.003° |
γ | 108.72 ± 0.003° |
Cell volume | 689.6 ± 0.3 Å3 |
Cell temperature | 153 ± 2 K |
Ambient diffraction temperature | 153 ± 2 K |
Number of distinct elements | 6 |
Space group number | 2 |
Hermann-Mauguin space group symbol | P -1 |
Hall space group symbol | -P 1 |
Residual factor for all reflections | 0.0364 |
Residual factor for significantly intense reflections | 0.0337 |
Weighted residual factors for significantly intense reflections | 0.0933 |
Weighted residual factors for all reflections included in the refinement | 0.0947 |
Goodness-of-fit parameter for all reflections included in the refinement | 1.096 |
Diffraction radiation wavelength | 0.71073 Å |
Diffraction radiation type | MoKα |