Information card for entry 7203708
Formula | C24 H46 N2 O6 Zr |
Calculated formula | C24 H46 N2 O6 Zr |
Title of publication | Deposition of HfO2 and ZrO2 films by liquid injection MOCVD using new monomeric alkoxide precursors |
Authors of publication | Loo, Yim Fun; O'Kane, Ruairi; Jones, Anthony C.; Aspinall, Helen C.; Potter, Richard J.; Chalker, Paul R.; Bickley, Jamie F.; Taylor, Stephen; Smith, Lesley M. |
Journal of publication | Journal of Materials Chemistry |
Year of publication | 2005 |
Journal volume | 15 |
Journal issue | 19 |
Pages of publication | 1896 |
a | 10.2627 ± 0.0009 Å |
b | 18.9374 ± 0.0017 Å |
c | 15.6465 ± 0.0014 Å |
α | 90° |
β | 104.772 ± 0.002° |
γ | 90° |
Cell volume | 2940.4 ± 0.5 Å3 |
Cell temperature | 100 ± 2 K |
Ambient diffraction temperature | 100 ± 2 K |
Number of distinct elements | 5 |
Space group number | 14 |
Hermann-Mauguin space group symbol | P 1 21/n 1 |
Hall space group symbol | -P 2yn |
Residual factor for all reflections | 0.0355 |
Residual factor for significantly intense reflections | 0.0309 |
Weighted residual factors for significantly intense reflections | 0.0777 |
Weighted residual factors for all reflections included in the refinement | 0.0799 |
Goodness-of-fit parameter for all reflections included in the refinement | 1.018 |
Diffraction radiation wavelength | 0.71073 Å |
Diffraction radiation type | MoKα |