Information card for entry 7203826
Formula | C30 H63 N6 Y |
Calculated formula | C30 H63 N6 Y |
Title of publication | Synthesis, structure and properties of volatile lanthanide complexes containing amidinate ligands: application for Er2O3 thin film growth by atomic layer deposition |
Authors of publication | Päiväsaari, Jani; Dezelah, IV, Charles L.; Back, Dwayne; El-Kaderi, Hani M.; Heeg, Mary Jane; Putkonen, Matti; Niinistö, Lauri; Winter, Charles H. |
Journal of publication | Journal of Materials Chemistry |
Year of publication | 2005 |
Journal volume | 15 |
Journal issue | 39 |
Pages of publication | 4224 |
a | 17.283 ± 0.0012 Å |
b | 11.7794 ± 0.0009 Å |
c | 19.1659 ± 0.0014 Å |
α | 90° |
β | 116.194 ± 0.001° |
γ | 90° |
Cell volume | 3501.2 ± 0.4 Å3 |
Cell temperature | 295 ± 2 K |
Ambient diffraction temperature | 295 ± 2 K |
Number of distinct elements | 4 |
Space group number | 15 |
Hermann-Mauguin space group symbol | C 1 2/c 1 |
Hall space group symbol | -C 2yc |
Residual factor for all reflections | 0.1232 |
Residual factor for significantly intense reflections | 0.0636 |
Weighted residual factors for significantly intense reflections | 0.1135 |
Weighted residual factors for all reflections included in the refinement | 0.1333 |
Goodness-of-fit parameter for all reflections included in the refinement | 1.03 |
Diffraction radiation wavelength | 0.71073 Å |
Diffraction radiation type | MoKα |