Information card for entry 7203827
Formula | C30 H63 La N6 |
Calculated formula | C30 H63 La N6 |
Title of publication | Synthesis, structure and properties of volatile lanthanide complexes containing amidinate ligands: application for Er2O3 thin film growth by atomic layer deposition |
Authors of publication | Päiväsaari, Jani; Dezelah, IV, Charles L.; Back, Dwayne; El-Kaderi, Hani M.; Heeg, Mary Jane; Putkonen, Matti; Niinistö, Lauri; Winter, Charles H. |
Journal of publication | Journal of Materials Chemistry |
Year of publication | 2005 |
Journal volume | 15 |
Journal issue | 39 |
Pages of publication | 4224 |
a | 16.973 ± 0.0006 Å |
b | 11.8555 ± 0.0004 Å |
c | 19.0849 ± 0.0007 Å |
α | 90° |
β | 116.065 ± 0.001° |
γ | 90° |
Cell volume | 3449.8 ± 0.2 Å3 |
Cell temperature | 100 ± 2 K |
Ambient diffraction temperature | 100 ± 2 K |
Number of distinct elements | 4 |
Space group number | 15 |
Hermann-Mauguin space group symbol | C 1 2/c 1 |
Hall space group symbol | -C 2yc |
Residual factor for all reflections | 0.0469 |
Residual factor for significantly intense reflections | 0.0434 |
Weighted residual factors for significantly intense reflections | 0.1189 |
Weighted residual factors for all reflections included in the refinement | 0.1201 |
Goodness-of-fit parameter for all reflections included in the refinement | 1.342 |
Diffraction radiation wavelength | 0.71073 Å |
Diffraction radiation type | MoKα |