Information card for entry 7203899
Chemical name | (38) |
Formula | C22 H36 N2 |
Calculated formula | C22 H36 N2 |
Title of publication | A short survey of bicyclic diamines ‒ syntheses and properties of N,N'-bridged-1,10-diazabicyclooctadeca-5,14-diynes |
Authors of publication | von Hirschheydt, Thomas; Wolfart, Volker; Gleiter, Rolf; Irngartinger, Hermann; Oeser, Thomas; Rominger, Frank; Eisenträger, Frank |
Journal of publication | Journal of the Chemical Society, Perkin Transactions 2 |
Year of publication | 2000 |
Journal issue | 2 |
Pages of publication | 175 |
a | 16.5939 ± 0.0008 Å |
b | 28.3186 ± 0.0013 Å |
c | 8.6029 ± 0.0004 Å |
α | 90° |
β | 90° |
γ | 90° |
Cell volume | 4042.6 ± 0.3 Å3 |
Cell temperature | 200 ± 2 K |
Ambient diffraction temperature | 200 ± 2 K |
Number of distinct elements | 3 |
Space group number | 43 |
Hermann-Mauguin space group symbol | F d d 2 |
Hall space group symbol | F 2 -2d |
Residual factor for all reflections | 0.0505 |
Residual factor for significantly intense reflections | 0.0406 |
Weighted residual factors for significantly intense reflections | 0.1074 |
Weighted residual factors for all reflections included in the refinement | 0.1144 |
Goodness-of-fit parameter for all reflections included in the refinement | 1.056 |
Diffraction radiation wavelength | 0.71073 Å |
Diffraction radiation type | MoKα |