Information card for entry 7203900
Chemical name | (39) |
Formula | C23 H38 N2 |
Calculated formula | C23 H38 N2 |
SMILES | C1CCCCCCN2CCCC#CCCCN1CCCC#CCCC2 |
Title of publication | A short survey of bicyclic diamines ‒ syntheses and properties of N,N'-bridged-1,10-diazabicyclooctadeca-5,14-diynes |
Authors of publication | von Hirschheydt, Thomas; Wolfart, Volker; Gleiter, Rolf; Irngartinger, Hermann; Oeser, Thomas; Rominger, Frank; Eisenträger, Frank |
Journal of publication | Journal of the Chemical Society, Perkin Transactions 2 |
Year of publication | 2000 |
Journal issue | 2 |
Pages of publication | 175 |
a | 16.0954 ± 0.0004 Å |
b | 33.2375 ± 0.0009 Å |
c | 7.8746 ± 0.0002 Å |
α | 90° |
β | 90° |
γ | 90° |
Cell volume | 4212.68 ± 0.19 Å3 |
Cell temperature | 200 ± 2 K |
Ambient diffraction temperature | 200 ± 2 K |
Number of distinct elements | 3 |
Space group number | 43 |
Hermann-Mauguin space group symbol | F d d 2 |
Hall space group symbol | F 2 -2d |
Residual factor for all reflections | 0.0269 |
Residual factor for significantly intense reflections | 0.0245 |
Weighted residual factors for significantly intense reflections | 0.0609 |
Weighted residual factors for all reflections included in the refinement | 0.0624 |
Goodness-of-fit parameter for all reflections included in the refinement | 1.07 |
Diffraction radiation wavelength | 0.71073 Å |
Diffraction radiation type | MoKα |