Information card for entry 7203902
Chemical name | 1,10-Diaza-21-oxabicyclo[8.8.5]tricosa-5,14-diyne (43) |
Formula | C20 H40 N2 O5 |
Calculated formula | C20 H36 N2 O3.625 |
Title of publication | A short survey of bicyclic diamines ‒ syntheses and properties of N,N'-bridged-1,10-diazabicyclooctadeca-5,14-diynes |
Authors of publication | von Hirschheydt, Thomas; Wolfart, Volker; Gleiter, Rolf; Irngartinger, Hermann; Oeser, Thomas; Rominger, Frank; Eisenträger, Frank |
Journal of publication | Journal of the Chemical Society, Perkin Transactions 2 |
Year of publication | 2000 |
Journal issue | 2 |
Pages of publication | 175 |
a | 8.899 ± 0.003 Å |
b | 12.364 ± 0.004 Å |
c | 20.155 ± 0.006 Å |
α | 104.35 ± 0.03° |
β | 94.56 ± 0.03° |
γ | 99.02 ± 0.03° |
Cell volume | 2105.5 ± 1.2 Å3 |
Cell temperature | 223 ± 2 K |
Ambient diffraction temperature | 223 ± 2 K |
Number of distinct elements | 4 |
Space group number | 2 |
Hermann-Mauguin space group symbol | P -1 |
Hall space group symbol | -P 1 |
Residual factor for all reflections | 0.119 |
Residual factor for significantly intense reflections | 0.0553 |
Weighted residual factors for significantly intense reflections | 0.159 |
Weighted residual factors for all reflections included in the refinement | 0.1878 |
Goodness-of-fit parameter for all reflections included in the refinement | 1.026 |
Diffraction radiation wavelength | 0.71073 Å |
Diffraction radiation type | MoKα |