Information card for entry 7203903
Chemical name |
(44) |
Formula |
C22 H36 N2 O2 |
Calculated formula |
C22 H36 N2 O2 |
SMILES |
N12CCCC#CCCCN(CCCC#CCCC1)CCOCCOCC2 |
Title of publication |
A short survey of bicyclic diamines ‒ syntheses and properties of N,N'-bridged-1,10-diazabicyclooctadeca-5,14-diynes |
Authors of publication |
von Hirschheydt, Thomas; Wolfart, Volker; Gleiter, Rolf; Irngartinger, Hermann; Oeser, Thomas; Rominger, Frank; Eisenträger, Frank |
Journal of publication |
Journal of the Chemical Society, Perkin Transactions 2 |
Year of publication |
2000 |
Journal issue |
2 |
Pages of publication |
175 |
a |
8.9706 ± 0.0001 Å |
b |
20.6147 ± 0.0003 Å |
c |
11.4614 ± 0.0001 Å |
α |
90° |
β |
94.86° |
γ |
90° |
Cell volume |
2111.89 ± 0.04 Å3 |
Cell temperature |
200 ± 2 K |
Ambient diffraction temperature |
200 ± 2 K |
Number of distinct elements |
4 |
Space group number |
14 |
Hermann-Mauguin space group symbol |
P 1 21/n 1 |
Hall space group symbol |
-P 2yn |
Residual factor for all reflections |
0.0455 |
Residual factor for significantly intense reflections |
0.0352 |
Weighted residual factors for significantly intense reflections |
0.0842 |
Weighted residual factors for all reflections included in the refinement |
0.0904 |
Goodness-of-fit parameter for all reflections included in the refinement |
1.035 |
Diffraction radiation wavelength |
0.71073 Å |
Diffraction radiation type |
MoKα |
Yes |
No |
No |