Information card for entry 7204758
Formula | C34 H84 N4 Nb2 O12 Sr |
Calculated formula | C34 H84 N4 Nb2 O12 Sr |
Title of publication | Synthesis and characterisation of four new heterometal alkoxides: potential precursors for the MOCVD of ferroelectric oxides |
Authors of publication | Jones, Anthony C.; Tobin, Neil L.; Marshall, Paul A.; Potter, Richard J.; Chalker, Paul R.; Bickley, Jamie F.; Davies, Hywel O.; Smith, Lesley M.; Critchlow, Gary W. |
Journal of publication | Journal of Materials Chemistry |
Year of publication | 2004 |
Journal volume | 14 |
Journal issue | 5 |
Pages of publication | 887 |
a | 20.796 ± 0.002 Å |
b | 9.7845 ± 0.0011 Å |
c | 25.62 ± 0.003 Å |
α | 90° |
β | 102.013 ± 0.013° |
γ | 90° |
Cell volume | 5099 ± 1 Å3 |
Cell temperature | 213 ± 2 K |
Ambient diffraction temperature | 213 ± 2 K |
Number of distinct elements | 6 |
Space group number | 14 |
Hermann-Mauguin space group symbol | P 1 21/n 1 |
Hall space group symbol | -P 2yn |
Residual factor for all reflections | 0.1507 |
Residual factor for significantly intense reflections | 0.0594 |
Weighted residual factors for significantly intense reflections | 0.1213 |
Weighted residual factors for all reflections included in the refinement | 0.1356 |
Goodness-of-fit parameter for all reflections included in the refinement | 0.847 |
Diffraction radiation wavelength | 0.71073 Å |
Diffraction radiation type | MoKα |