Information card for entry 7204759
Formula | C32 H82 N2 Nb2 O14 Sr |
Calculated formula | C32 H82 N2 Nb2 O14 Sr |
Title of publication | Synthesis and characterisation of four new heterometal alkoxides: potential precursors for the MOCVD of ferroelectric oxides |
Authors of publication | Jones, Anthony C.; Tobin, Neil L.; Marshall, Paul A.; Potter, Richard J.; Chalker, Paul R.; Bickley, Jamie F.; Davies, Hywel O.; Smith, Lesley M.; Critchlow, Gary W. |
Journal of publication | Journal of Materials Chemistry |
Year of publication | 2004 |
Journal volume | 14 |
Journal issue | 5 |
Pages of publication | 887 |
a | 14.997 ± 0.0019 Å |
b | 16.743 ± 0.003 Å |
c | 19.587 ± 0.002 Å |
α | 90° |
β | 90° |
γ | 90° |
Cell volume | 4918.2 ± 1.2 Å3 |
Cell temperature | 213 ± 2 K |
Ambient diffraction temperature | 213 ± 2 K |
Number of distinct elements | 6 |
Space group number | 60 |
Hermann-Mauguin space group symbol | P b c n |
Hall space group symbol | -P 2n 2ab |
Residual factor for all reflections | 0.119 |
Residual factor for significantly intense reflections | 0.0503 |
Weighted residual factors for significantly intense reflections | 0.1088 |
Weighted residual factors for all reflections included in the refinement | 0.1276 |
Goodness-of-fit parameter for all reflections included in the refinement | 0.743 |
Diffraction radiation wavelength | 0.71073 Å |
Diffraction radiation type | MoKα |