Information card for entry 7204770
External links | ChemSpider |
Chemical name | 1-(pentafluorophenyl)-2-phenylacetylene |
Formula | C14 H5 F5 |
Calculated formula | C14 H5 F5 |
SMILES | c1(F)c(F)c(F)c(c(F)c1F)C#Cc1ccccc1 |
Title of publication | Arene-perfluoroarene interactions in crystal engineering: structural preferences in polyfluorinated tolansArene?perfluoroarene interactions in crystal engineering. Part 9. Presented in part at the 16th International Symposium on Fluorine Chemistry, University of Durham, 2000. Abstract 1P-102. For part 8 see ref. 1.Electronic supplementary information (ESI) available: spectroscopic characterisation for 4b?k; plots of energy as a function of inter-ring torsion angle in 1,2,3,4,5-pentafluorotolan and as a function of C(Ph)?C(Ph)?O?C(Me) torsion angle in PhOMe. See http://www.rsc.org/suppdata/jm/b3/b314094f/ |
Authors of publication | Smith, Caroline E.; Smith, Philip S.; Thomas, Rhodri Ll.; Robins, Edward G.; Collings, Jonathan C.; Dai, Chaoyang; Scott, Andrew J.; Borwick, Simon; Batsanov, Andrei S.; Watt, Stephen W.; Clark, Stewart J.; Viney, Christopher; Howard, Judith A. K.; Clegg, William; Marder, Todd B. |
Journal of publication | Journal of Materials Chemistry |
Year of publication | 2004 |
Journal volume | 14 |
Journal issue | 3 |
Pages of publication | 413 |
a | 6.1305 ± 0.001 Å |
b | 7.2444 ± 0.0012 Å |
c | 12.754 ± 0.002 Å |
α | 85.229 ± 0.004° |
β | 84.793 ± 0.004° |
γ | 85.766 ± 0.004° |
Cell volume | 560.88 ± 0.16 Å3 |
Cell temperature | 160 ± 2 K |
Ambient diffraction temperature | 160 ± 2 K |
Number of distinct elements | 3 |
Space group number | 2 |
Hermann-Mauguin space group symbol | P -1 |
Hall space group symbol | -P 1 |
Residual factor for all reflections | 0.0971 |
Residual factor for significantly intense reflections | 0.0623 |
Weighted residual factors for all reflections | 0.1767 |
Weighted residual factors for all reflections included in the refinement | 0.1584 |
Goodness-of-fit parameter for all reflections | 1.059 |
Goodness-of-fit parameter for all reflections included in the refinement | 1.213 |
Diffraction radiation wavelength | 0.71073 Å |
Diffraction radiation type | MoKα |