Information card for entry 7204787
Common name |
Yttrium Iron Molybdenum Oxide |
Chemical name |
Yttrium Iron Molybdenum Oxide |
Formula |
Fe Mo O7 Y2 |
Calculated formula |
Fe1.005 Mo0.995 O7 Y2 |
Title of publication |
Synthesis and characterization of the new Ln2FeMoO7 (Ln = Y, Dy, Ho) compounds |
Authors of publication |
Veith, Gabriel M.; Lobanov, Maxim V.; Emge, Thomas J.; Greenblatt, Martha; Croft, Mark; Stowasser, Frank; Hadermann, Joke; Tendeloo, Gustaaf Van |
Journal of publication |
Journal of Materials Chemistry |
Year of publication |
2004 |
Journal volume |
14 |
Journal issue |
10 |
Pages of publication |
1623 |
a |
12.8276 ± 0.0007 Å |
b |
7.4062 ± 0.0004 Å |
c |
11.4938 ± 0.0003 Å |
α |
90° |
β |
100.662 ± 0.005° |
γ |
90° |
Cell volume |
1073.1 ± 0.09 Å3 |
Ambient diffraction temperature |
293 K |
Number of distinct elements |
4 |
Space group number |
15 |
Hermann-Mauguin space group symbol |
C 1 2/c 1 |
Hall space group symbol |
-C 2yc |
Goodness-of-fit parameter for all reflections |
1.77 |
Method of determination |
powder diffraction |
Diffraction radiation type |
CuKα |
Yes |
No |
No |