Information card for entry 7204788
Common name |
Holmium Iron Molybdenum Oxide |
Chemical name |
Holmium Iron Molybdenum Oxide |
Formula |
Fe Ho2 Mo O7 |
Calculated formula |
Fe Ho2 Mo O7 |
Title of publication |
Synthesis and characterization of the new Ln2FeMoO7 (Ln = Y, Dy, Ho) compounds |
Authors of publication |
Veith, Gabriel M.; Lobanov, Maxim V.; Emge, Thomas J.; Greenblatt, Martha; Croft, Mark; Stowasser, Frank; Hadermann, Joke; Tendeloo, Gustaaf Van |
Journal of publication |
Journal of Materials Chemistry |
Year of publication |
2004 |
Journal volume |
14 |
Journal issue |
10 |
Pages of publication |
1623 |
a |
7.4117 ± 0.0002 Å |
b |
7.4117 Å |
c |
16.9197 ± 0.0006 Å |
α |
90° |
β |
90° |
γ |
120° |
Cell volume |
804.93 ± 0.04 Å3 |
Ambient diffraction temperature |
293 K |
Number of distinct elements |
4 |
Space group number |
148 |
Hermann-Mauguin space group symbol |
R -3 :H |
Hall space group symbol |
-R 3 |
Goodness-of-fit parameter for all reflections |
1.31 |
Method of determination |
powder diffraction |
Diffraction radiation type |
CuKα |
Yes |
No |
No |