Information card for entry 7204813
Formula | C33 H34 N9 O7 Pb |
Calculated formula | C33 H34 N9 O7 Pb |
Title of publication | Novel Pb(ii) coordination frameworks: synthesis, crystal structures and unusual third-order nonlinear optical propertiesElectronic supplementary information (ESI) available: crystal packing diagram of complex 2. See http://www.rsc.org/suppdata/jm/b3/b315682f/ |
Authors of publication | Sui, Bin; Zhao, Wei; Ma, Guohong; Okamura, Taka-aki; Fan, Jian; Li, Yi-Zhi; Tang, Sing-Hai; Sun, Wei-Yin; Ueyama, Norikazu |
Journal of publication | Journal of Materials Chemistry |
Year of publication | 2004 |
Journal volume | 14 |
Journal issue | 10 |
Pages of publication | 1631 |
a | 10.236 ± 0.001 Å |
b | 11.672 ± 0.002 Å |
c | 15.299 ± 0.002 Å |
α | 73.5 ± 0.01° |
β | 86.58 ± 0.01° |
γ | 81.92 ± 0.01° |
Cell volume | 1734.8 ± 0.4 Å3 |
Cell temperature | 293 ± 2 K |
Ambient diffraction temperature | 293 ± 2 K |
Number of distinct elements | 5 |
Space group number | 2 |
Hermann-Mauguin space group symbol | P -1 |
Hall space group symbol | -P 1 |
Residual factor for all reflections | 0.0725 |
Residual factor for significantly intense reflections | 0.0565 |
Weighted residual factors for significantly intense reflections | 0.1446 |
Weighted residual factors for all reflections included in the refinement | 0.1489 |
Goodness-of-fit parameter for all reflections included in the refinement | 1.043 |
Diffraction radiation wavelength | 0.71073 Å |
Diffraction radiation type | MoKα |