Information card for entry 7204814
Common name | 1T niobium disulfide |
Chemical name | niobium disulfide |
Formula | Nb S2 |
Calculated formula | Nb S2 |
SMILES | [Nb+4].[S-2].[S-2] |
Title of publication | Formation of a new (1T) trigonal NbS2 polytype via atmospheric pressure chemical vapour depositionElectronic supplementary information (ESI) available: structure refinements of the NbS2 films and crystallographic data in CIF format. See http://www.rsc.org/suppdata/jm/b3/b315782m/ |
Authors of publication | Carmalt, Claire J.; Manning, Troy D.; Parkin, Ivan P.; Peters, Emily S.; Hector, Andrew L. |
Journal of publication | Journal of Materials Chemistry |
Year of publication | 2004 |
Journal volume | 14 |
Journal issue | 3 |
Pages of publication | 290 |
a | 3.42 ± 0.006 Å |
b | 3.42 Å |
c | 5.938 ± 0.011 Å |
α | 90° |
β | 90° |
γ | 120° |
Cell volume | 60.15 ± 0.15 Å3 |
Cell temperature | 293 K |
Ambient diffraction temperature | 293 K |
Number of distinct elements | 2 |
Space group number | 164 |
Hermann-Mauguin space group symbol | P -3 m 1 |
Hall space group symbol | -P 3 2" |
RFsqd | 0.36152 |
Goodness-of-fit parameter for all reflections | 1.38 |
Method of determination | powder diffraction |
Diffraction radiation probe | x-ray |
Diffraction radiation wavelength | 1.2982 Å |
Diffraction radiation type | synchrotron |