Information card for entry 7204857
Formula | C121 H74 Cl2 Mo12 O40 P |
Calculated formula | C121 H74 Cl2 Mo12 O40 P |
Title of publication | New conducting radical salts based upon Keggin-type polyoxometalates and perylene |
Authors of publication | Eugenio Coronado; José R. Galán-Mascarós; Carlos Giménez-Saiz; Carlos J. Gómez-García; Eugenia Martínez-Ferrero; Manuel Almeida; Elsa B. Lopes; Silvia C. Capelli; Rosa M. Llusar |
Journal of publication | J. Mater. Chem. |
Year of publication | 2004 |
Journal volume | 14 |
Journal issue | 12 |
Pages of publication | 1867 - 1872 |
a | 14.059 ± 0.003 Å |
b | 14.27 ± 0.003 Å |
c | 27.053 ± 0.005 Å |
α | 88.27 ± 0.03° |
β | 86.65 ± 0.03° |
γ | 86.02 ± 0.03° |
Cell volume | 5403.2 ± 1.9 Å3 |
Cell temperature | 293 ± 2 K |
Ambient diffraction temperature | 293 ± 2 K |
Number of distinct elements | 6 |
Space group number | 2 |
Hermann-Mauguin space group symbol | P -1 |
Hall space group symbol | -P 1 |
Residual factor for all reflections | 0.0928 |
Residual factor for significantly intense reflections | 0.0733 |
Weighted residual factors for significantly intense reflections | 0.1822 |
Weighted residual factors for all reflections included in the refinement | 0.2164 |
Goodness-of-fit parameter for all reflections included in the refinement | 1.088 |
Diffraction radiation wavelength | 0.7 Å |
Diffraction radiation type | synchrotron |