Information card for entry 7204858
Formula | C122 H75 Mo12 N O40 P |
Calculated formula | C122 H75 Mo12 N O40 P |
Title of publication | New conducting radical salts based upon Keggin-type polyoxometalates and perylene |
Authors of publication | Eugenio Coronado; José R. Galán-Mascarós; Carlos Giménez-Saiz; Carlos J. Gómez-García; Eugenia Martínez-Ferrero; Manuel Almeida; Elsa B. Lopes; Silvia C. Capelli; Rosa M. Llusar |
Journal of publication | J. Mater. Chem. |
Year of publication | 2004 |
Journal volume | 14 |
Journal issue | 12 |
Pages of publication | 1867 - 1872 |
a | 13.9695 ± 0.0002 Å |
b | 14.1207 ± 0.0002 Å |
c | 27.557 ± 0.0003 Å |
α | 87.3761 ± 0.0005° |
β | 89.5155 ± 0.0005° |
γ | 86.1853 ± 0.0005° |
Cell volume | 5418.06 ± 0.12 Å3 |
Cell temperature | 293 ± 2 K |
Ambient diffraction temperature | 293 ± 2 K |
Number of distinct elements | 6 |
Space group number | 2 |
Hermann-Mauguin space group symbol | P -1 |
Hall space group symbol | -P 1 |
Residual factor for all reflections | 0.064 |
Residual factor for significantly intense reflections | 0.0406 |
Weighted residual factors for significantly intense reflections | 0.1185 |
Weighted residual factors for all reflections included in the refinement | 0.141 |
Goodness-of-fit parameter for all reflections included in the refinement | 1.18 |
Diffraction radiation wavelength | 0.71073 Å |
Diffraction radiation type | MoKα |