Information card for entry 7204859
Formula | C122 H126 N2 O40 Si W12 |
Calculated formula | C122 H126 N2 O40 Si W12 |
Title of publication | New conducting radical salts based upon Keggin-type polyoxometalates and perylene |
Authors of publication | Eugenio Coronado; José R. Galán-Mascarós; Carlos Giménez-Saiz; Carlos J. Gómez-García; Eugenia Martínez-Ferrero; Manuel Almeida; Elsa B. Lopes; Silvia C. Capelli; Rosa M. Llusar |
Journal of publication | J. Mater. Chem. |
Year of publication | 2004 |
Journal volume | 14 |
Journal issue | 12 |
Pages of publication | 1867 - 1872 |
a | 18.366 ± 0.004 Å |
b | 18.547 ± 0.005 Å |
c | 19.172 ± 0.005 Å |
α | 83.033 ± 0.007° |
β | 84.736 ± 0.007° |
γ | 67.564 ± 0.007° |
Cell volume | 5984 ± 3 Å3 |
Cell temperature | 293 ± 2 K |
Ambient diffraction temperature | 293 ± 2 K |
Number of distinct elements | 6 |
Space group number | 2 |
Hermann-Mauguin space group symbol | P -1 |
Hall space group symbol | -P 1 |
Residual factor for all reflections | 0.4312 |
Residual factor for significantly intense reflections | 0.1451 |
Weighted residual factors for significantly intense reflections | 0.3111 |
Weighted residual factors for all reflections included in the refinement | 0.415 |
Goodness-of-fit parameter for all reflections included in the refinement | 0.924 |
Diffraction radiation wavelength | 0.71069 Å |
Diffraction radiation type | MoKα |