Information card for entry 7204869
Formula | C3 H6 Ni O6 |
Calculated formula | C3 H2 Ni O6 |
Title of publication | Synthesis, crystal structure and magnetic properties of two-dimensional malonato-bridged cobalt(II) and nickel(II) compounds |
Authors of publication | Fernando S. Delgado; María Hernández-Molina; Joaquín Sanchiz; Catalina Ruiz-Pérez; Yolanda Rodríguez-Martín; Trinidad López; Francesc Lloret; Miguel Julve |
Journal of publication | CrystEngComm |
Year of publication | 2004 |
Journal volume | 6 |
Journal issue | 22 |
Pages of publication | 106 - 111 |
a | 12.5748 ± 0.0005 Å |
b | 7.3781 ± 0.0006 Å |
c | 7.2274 ± 0.0004 Å |
α | 90° |
β | 120.391 ± 0.006° |
γ | 90° |
Cell volume | 578.41 ± 0.07 Å3 |
Cell temperature | 293 ± 2 K |
Ambient diffraction temperature | 293 ± 2 K |
Number of distinct elements | 4 |
Space group number | 12 |
Hermann-Mauguin space group symbol | C 1 2/m 1 |
Hall space group symbol | -C 2y |
Residual factor for all reflections | 0.071 |
Residual factor for significantly intense reflections | 0.0421 |
Weighted residual factors for significantly intense reflections | 0.086 |
Weighted residual factors for all reflections included in the refinement | 0.0921 |
Goodness-of-fit parameter for all reflections included in the refinement | 1.095 |
Diffraction radiation probe | x-ray |
Diffraction radiation wavelength | 0.71073 Å |
Diffraction radiation type | MoKα |