Information card for entry 7204870
Common name |
2,5-Bis-(2,2')bithiophenyl-5-yl-thiazolo(5,4-d)thiazole |
Formula |
C20 H10 N2 S6 |
Calculated formula |
C20 H7 N2 S6 |
Title of publication |
Synthesis, physical properties, and field-effect transistors of novel thiophene/thiazolothiazole co-oligomers |
Authors of publication |
Ando, Shinji; Nishida, Jun-ichi; Inoue, Youji; Tokito, Shizuo; Yamashita, Yoshiro |
Journal of publication |
Journal of Materials Chemistry |
Year of publication |
2004 |
Journal volume |
14 |
Journal issue |
12 |
Pages of publication |
1787 |
a |
6.054 ± 0.003 Å |
b |
8.226 ± 0.004 Å |
c |
19.641 ± 0.009 Å |
α |
87.74 ± 0.04° |
β |
81.23 ± 0.04° |
γ |
82.53 ± 0.04° |
Cell volume |
958.3 ± 0.8 Å3 |
Cell temperature |
296.2 K |
Number of distinct elements |
4 |
Space group number |
2 |
Hermann-Mauguin space group symbol |
P -1 |
Hall space group symbol |
-P 1 |
Residual factor for significantly intense reflections |
0.0648 |
Weighted residual factors for all reflections included in the refinement |
0.163 |
Goodness-of-fit parameter for all reflections included in the refinement |
2.136 |
Diffraction radiation wavelength |
0.7107 Å |
Diffraction radiation type |
MoKα |
Yes |
No |
No |