Information card for entry 7205047
Formula | C20 H26 Co3 N12 O17 |
Calculated formula | C20 H24 Co3 N12 O17 |
Title of publication | Diverse mixed-ligand metal complexes with in situ generated 5-(pyrazinyl)tetrazolate chelating-bridging ligand: in situ synthesis, crystal structures, magnetic and luminescent properties |
Authors of publication | Yang, En-Cui; Feng, Yan; Liu, Zhong-Yi; Liu, Tian-Yu; Zhao, Xiao-Jun |
Journal of publication | CrystEngComm |
Year of publication | 2011 |
Journal volume | 13 |
Journal issue | 1 |
Pages of publication | 230 |
a | 8.2152 ± 0.0004 Å |
b | 8.9387 ± 0.0004 Å |
c | 12.3961 ± 0.0005 Å |
α | 109.846 ± 0.001° |
β | 92.651 ± 0.001° |
γ | 106.725 ± 0.001° |
Cell volume | 809.46 ± 0.06 Å3 |
Cell temperature | 296 ± 2 K |
Ambient diffraction temperature | 296 ± 2 K |
Number of distinct elements | 5 |
Space group number | 2 |
Hermann-Mauguin space group symbol | P -1 |
Hall space group symbol | -P 1 |
Residual factor for all reflections | 0.031 |
Residual factor for significantly intense reflections | 0.028 |
Weighted residual factors for significantly intense reflections | 0.0725 |
Weighted residual factors for all reflections included in the refinement | 0.0743 |
Goodness-of-fit parameter for all reflections included in the refinement | 1.023 |
Diffraction radiation wavelength | 0.71073 Å |
Diffraction radiation type | MoKα |