Information card for entry 7205048
Formula | C10 H9 Cu N6 O6 |
Calculated formula | C10 H7 Cu N6 O6 |
Title of publication | Diverse mixed-ligand metal complexes with in situ generated 5-(pyrazinyl)tetrazolate chelating-bridging ligand: in situ synthesis, crystal structures, magnetic and luminescent properties |
Authors of publication | Yang, En-Cui; Feng, Yan; Liu, Zhong-Yi; Liu, Tian-Yu; Zhao, Xiao-Jun |
Journal of publication | CrystEngComm |
Year of publication | 2011 |
Journal volume | 13 |
Journal issue | 1 |
Pages of publication | 230 |
a | 7.8365 ± 0.001 Å |
b | 8.2326 ± 0.0011 Å |
c | 10.7944 ± 0.0015 Å |
α | 111.154 ± 0.002° |
β | 95.728 ± 0.002° |
γ | 94.674 ± 0.002° |
Cell volume | 641.03 ± 0.15 Å3 |
Cell temperature | 296 ± 2 K |
Ambient diffraction temperature | 296 ± 2 K |
Number of distinct elements | 5 |
Space group number | 2 |
Hermann-Mauguin space group symbol | P -1 |
Hall space group symbol | -P 1 |
Residual factor for all reflections | 0.039 |
Residual factor for significantly intense reflections | 0.0305 |
Weighted residual factors for significantly intense reflections | 0.0722 |
Weighted residual factors for all reflections included in the refinement | 0.0774 |
Goodness-of-fit parameter for all reflections included in the refinement | 1.036 |
Diffraction radiation wavelength | 0.71073 Å |
Diffraction radiation type | MoKα |