Information card for entry 7205049
Formula | C6 H5 Cd N6 O3 |
Calculated formula | C6 H5 Cd N6 O3 |
Title of publication | Diverse mixed-ligand metal complexes with in situ generated 5-(pyrazinyl)tetrazolate chelating-bridging ligand: in situ synthesis, crystal structures, magnetic and luminescent properties |
Authors of publication | Yang, En-Cui; Feng, Yan; Liu, Zhong-Yi; Liu, Tian-Yu; Zhao, Xiao-Jun |
Journal of publication | CrystEngComm |
Year of publication | 2011 |
Journal volume | 13 |
Journal issue | 1 |
Pages of publication | 230 |
a | 5.8768 ± 0.0005 Å |
b | 13.1226 ± 0.0012 Å |
c | 11.5664 ± 0.0011 Å |
α | 90° |
β | 94.788 ± 0.001° |
γ | 90° |
Cell volume | 888.88 ± 0.14 Å3 |
Cell temperature | 296 ± 2 K |
Ambient diffraction temperature | 296 ± 2 K |
Number of distinct elements | 5 |
Space group number | 14 |
Hermann-Mauguin space group symbol | P 1 21/n 1 |
Hall space group symbol | -P 2yn |
Residual factor for all reflections | 0.0164 |
Residual factor for significantly intense reflections | 0.0157 |
Weighted residual factors for significantly intense reflections | 0.0396 |
Weighted residual factors for all reflections included in the refinement | 0.04 |
Goodness-of-fit parameter for all reflections included in the refinement | 1.063 |
Diffraction radiation wavelength | 0.71073 Å |
Diffraction radiation type | MoKα |