Information card for entry 7206469
Formula | C25 H39 Ag2 N8 O11.5 |
Calculated formula | C25 H35 Ag2 N8 O11.5 |
Title of publication | Syntheses, structures, and photoluminescence of five silver(i) coordination polymers based on tetrakis(imidazol-1-ylmethyl)methane |
Authors of publication | Bai, Hong-Ye; Yang, Jin; Liu, Bo; Ma, Jian-Fang; Kan, Wei-Qiu; Liu, Yun-Yu; Liu, Ying-Ying |
Journal of publication | CrystEngComm |
Year of publication | 2011 |
Journal volume | 13 |
Journal issue | 19 |
Pages of publication | 5877 |
a | 11.406 ± 0.005 Å |
b | 17.637 ± 0.005 Å |
c | 16.979 ± 0.005 Å |
α | 90 ± 0.005° |
β | 106.836 ± 0.005° |
γ | 90 ± 0.005° |
Cell volume | 3269 ± 2 Å3 |
Cell temperature | 293 ± 2 K |
Ambient diffraction temperature | 293 ± 2 K |
Number of distinct elements | 5 |
Space group number | 14 |
Hermann-Mauguin space group symbol | P 1 21/n 1 |
Hall space group symbol | -P 2yn |
Residual factor for all reflections | 0.0713 |
Residual factor for significantly intense reflections | 0.0385 |
Weighted residual factors for significantly intense reflections | 0.0898 |
Weighted residual factors for all reflections included in the refinement | 0.0971 |
Goodness-of-fit parameter for all reflections included in the refinement | 0.904 |
Diffraction radiation wavelength | 0.71073 Å |
Diffraction radiation type | MoKα |