Information card for entry 7208628
Formula | C30 H30 N4 O2 |
Calculated formula | C30 H30 N4 O2 |
SMILES | c1(cc(ccc1)c1cc(ccc1)c1nnc(C(C)(C)C)o1)c1cc(ccc1)c1nnc(C(C)(C)C)o1 |
Title of publication | Synthesis and physical properties of meta-terphenyloxadiazole derivatives and their application as electron transporting materials for blue phosphorescent and fluorescent devices |
Authors of publication | Wu, Cheng-An; Chou, Ho-Hsiu; Shih, Cheng-Hung; Wu, Fang-Iy; Cheng, Chien-Hong; Huang, Heh-Lung; Chao, Teng-Chih; Tseng, Mei-Rurng |
Journal of publication | Journal of Materials Chemistry |
Year of publication | 2012 |
Journal volume | 22 |
Journal issue | 34 |
Pages of publication | 17792 |
a | 8.9685 ± 0.0003 Å |
b | 10.0847 ± 0.0003 Å |
c | 14.7906 ± 0.0005 Å |
α | 105.015 ± 0.002° |
β | 95.313 ± 0.001° |
γ | 90.297 ± 0.001° |
Cell volume | 1285.91 ± 0.07 Å3 |
Cell temperature | 100 ± 2 K |
Ambient diffraction temperature | 100 ± 2 K |
Number of distinct elements | 4 |
Space group number | 2 |
Hermann-Mauguin space group symbol | P -1 |
Hall space group symbol | -P 1 |
Residual factor for all reflections | 0.0456 |
Residual factor for significantly intense reflections | 0.0369 |
Weighted residual factors for significantly intense reflections | 0.0997 |
Weighted residual factors for all reflections included in the refinement | 0.1152 |
Goodness-of-fit parameter for all reflections included in the refinement | 1.094 |
Diffraction radiation wavelength | 0.71073 Å |
Diffraction radiation type | MoKα |