Information card for entry 7208629
Formula | C25 H18 Cd N2 O7 |
Calculated formula | C25 H18 Cd N2 O7 |
Title of publication | Highly stable photochromic crystalline material based on a close-packed layered metal‒viologen coordination polymer |
Authors of publication | Tan, Yi; Fu, Zhiyong; Zeng, Yu; Chen, Hengjun; Liao, Shijun; Zhang, Jie; Dai, Jingcao |
Journal of publication | Journal of Materials Chemistry |
Year of publication | 2012 |
Journal volume | 22 |
Journal issue | 34 |
Pages of publication | 17452 |
a | 10.107 ± 0.002 Å |
b | 10.762 ± 0.002 Å |
c | 11.847 ± 0.003 Å |
α | 76.07 ± 0.03° |
β | 73.47 ± 0.04° |
γ | 62.02 ± 0.03° |
Cell volume | 1082.2 ± 0.5 Å3 |
Cell temperature | 298 ± 2 K |
Ambient diffraction temperature | 298 ± 2 K |
Number of distinct elements | 5 |
Space group number | 2 |
Hermann-Mauguin space group symbol | P -1 |
Hall space group symbol | -P 1 |
Residual factor for all reflections | 0.0452 |
Residual factor for significantly intense reflections | 0.0281 |
Weighted residual factors for significantly intense reflections | 0.065 |
Weighted residual factors for all reflections included in the refinement | 0.0895 |
Goodness-of-fit parameter for all reflections included in the refinement | 1.062 |
Diffraction radiation wavelength | 0.71073 Å |
Diffraction radiation type | MoKα |