Information card for entry 7208633
Formula | C66 H59 Br4 Eu N10 O11 Zn2 |
Calculated formula | C66 H53 Br4 Eu N10 O11 Zn2 |
Title of publication | Functional heterometallic coordination polymers with metalloligands as tunable luminescent crystalline materials |
Authors of publication | Du, Dong-Ying; Qin, Jun-Sheng; Sun, Cheng-Xin; Wang, Xin-Long; Zhang, Shu-Ran; Shen, Ping; Li, Shun-Li; Su, Zhong-Min; Lan, Ya-Qian |
Journal of publication | Journal of Materials Chemistry |
Year of publication | 2012 |
Journal volume | 22 |
Journal issue | 37 |
Pages of publication | 19673 |
a | 15.665 ± 0.001 Å |
b | 13.512 ± 0.0008 Å |
c | 33.082 ± 0.002 Å |
α | 90° |
β | 99.933 ± 0.001° |
γ | 90° |
Cell volume | 6897.4 ± 0.7 Å3 |
Cell temperature | 293 ± 2 K |
Ambient diffraction temperature | 293 ± 2 K |
Number of distinct elements | 7 |
Space group number | 14 |
Hermann-Mauguin space group symbol | P 1 21/n 1 |
Hall space group symbol | -P 2yn |
Residual factor for all reflections | 0.1012 |
Residual factor for significantly intense reflections | 0.0545 |
Weighted residual factors for significantly intense reflections | 0.1513 |
Weighted residual factors for all reflections included in the refinement | 0.1744 |
Goodness-of-fit parameter for all reflections included in the refinement | 1.044 |
Diffraction radiation wavelength | 0.71069 Å |
Diffraction radiation type | MoKα |