Information card for entry 7208634
Formula | C66 H59 Br4 Eu0.75 N10 O11 Tb0.25 Zn2 |
Calculated formula | C66 H53 Br4 Eu0.75 N10 O11 Tb0.25 Zn2 |
Title of publication | Functional heterometallic coordination polymers with metalloligands as tunable luminescent crystalline materials |
Authors of publication | Du, Dong-Ying; Qin, Jun-Sheng; Sun, Cheng-Xin; Wang, Xin-Long; Zhang, Shu-Ran; Shen, Ping; Li, Shun-Li; Su, Zhong-Min; Lan, Ya-Qian |
Journal of publication | Journal of Materials Chemistry |
Year of publication | 2012 |
Journal volume | 22 |
Journal issue | 37 |
Pages of publication | 19673 |
a | 15.755 ± 0.0012 Å |
b | 13.537 ± 0.001 Å |
c | 33.101 ± 0.003 Å |
α | 90° |
β | 99.782 ± 0.001° |
γ | 90° |
Cell volume | 6957 ± 1 Å3 |
Cell temperature | 293 ± 2 K |
Ambient diffraction temperature | 293 ± 2 K |
Number of distinct elements | 8 |
Space group number | 14 |
Hermann-Mauguin space group symbol | P 1 21/n 1 |
Hall space group symbol | -P 2yn |
Residual factor for all reflections | 0.1152 |
Residual factor for significantly intense reflections | 0.0601 |
Weighted residual factors for significantly intense reflections | 0.1853 |
Weighted residual factors for all reflections included in the refinement | 0.2174 |
Goodness-of-fit parameter for all reflections included in the refinement | 0.989 |
Diffraction radiation wavelength | 0.71069 Å |
Diffraction radiation type | MoKα |