Information card for entry 7211557
Formula | C19 H12 Eu N O7 |
Calculated formula | C19 H12 Eu N O7 |
Title of publication | Controlled synthesis, structures and properties of one-, two-, and three-dimensional lanthanide coordination polymers based on (8-quinolyloxy)acetate |
Authors of publication | Fan, Jun; Wang, Zhi-Hong; Yang, Ming; Yin, Xia; Zhang, Wei-Guang; Huang, Zhuo-Fen; Zeng, Rong-Hua |
Journal of publication | CrystEngComm |
Year of publication | 2010 |
Journal volume | 12 |
Journal issue | 1 |
Pages of publication | 216 |
a | 10.8671 ± 0.0003 Å |
b | 10.8974 ± 0.0003 Å |
c | 15.8338 ± 0.0004 Å |
α | 90° |
β | 117.385 ± 0.002° |
γ | 90° |
Cell volume | 1664.96 ± 0.08 Å3 |
Cell temperature | 298 ± 2 K |
Ambient diffraction temperature | 298 ± 2 K |
Number of distinct elements | 5 |
Space group number | 14 |
Hermann-Mauguin space group symbol | P 1 21/c 1 |
Hall space group symbol | -P 2ybc |
Residual factor for all reflections | 0.0268 |
Residual factor for significantly intense reflections | 0.0196 |
Weighted residual factors for significantly intense reflections | 0.0555 |
Weighted residual factors for all reflections included in the refinement | 0.0733 |
Goodness-of-fit parameter for all reflections included in the refinement | 1.01 |
Diffraction radiation wavelength | 0.71073 Å |
Diffraction radiation type | MoKα |