Information card for entry 7211914
Formula |
C32 H26 Co5 O24 |
Calculated formula |
C32 H26 Co5 O24 |
Title of publication |
Coordination polymers of biphenyl-2,4,2′,4′-tetracarboxylic acid—synthesis, structures and adsorption properties |
Authors of publication |
Jia, Juan; Shao, Min; Jia, Tiantian; Zhu, Shourong; Zhao, Yongmei; Xing, Feifei; Li, Mingxing |
Journal of publication |
CrystEngComm |
Year of publication |
2010 |
Journal volume |
12 |
Journal issue |
5 |
Pages of publication |
1548 |
a |
9.0444 ± 0.0017 Å |
b |
16.46 ± 0.003 Å |
c |
12.074 ± 0.002 Å |
α |
90° |
β |
93.437 ± 0.003° |
γ |
90° |
Cell volume |
1794.2 ± 0.6 Å3 |
Cell temperature |
296 ± 2 K |
Ambient diffraction temperature |
296 ± 2 K |
Number of distinct elements |
4 |
Space group number |
14 |
Hermann-Mauguin space group symbol |
P 1 21/n 1 |
Hall space group symbol |
-P 2yn |
Residual factor for all reflections |
0.0901 |
Residual factor for significantly intense reflections |
0.0524 |
Weighted residual factors for significantly intense reflections |
0.099 |
Weighted residual factors for all reflections included in the refinement |
0.117 |
Goodness-of-fit parameter for all reflections included in the refinement |
1.038 |
Diffraction radiation wavelength |
0.71073 Å |
Diffraction radiation type |
MoKα |
Yes |
No |
No |